BDBM497038 US11001561, Compound 32b
SMILES C[C@H]1OCC2(CCN(CC2)c2cc(=O)n(c(C)n2)-c2c(F)ccc(Cl)c2Cl)[C@@H]1N
InChI Key InChIKey=ZFBFRPDAJOBGCY-NSPYISDASA-N
Data  1 IC50
  Tab Delimited (TSV)   2D SDfile   Computed 3D by Vconf -m prep SDfile
Find this compound or compounds like it in BindingDB:
Activity Spreadsheet -- Enzyme Inhibition Constant Data from BindingDB
Found 1 hit for monomerid = 497038
TargetTyrosine-protein phosphatase non-receptor type 11(Homo sapiens (Human))
Merck Patent
US Patent
LigandPNGBDBM497038(US11001561, Compound 32b)
Affinity DataIC50:  1.90E+3nM. Assay description: The inhibition of SHP2 by compounds of the invention was monitored using the surrogate substrate DiFMUP after protein activation by a peptide bearing...
Ligand InfoPC cidPC sid
In DepthDetails US Patent